{"text_format":"1","workbook":"xlsx","n_sheets":8,"sheets":["Home","Main Page","Entries table","Report","BlankPage","WelcomePage","Settings","DevFrame"],"not_rendered":{"charts":0,"images":1,"macros":1,"external_links":0,"defined_names":214,"comments":0,"pivot_tables":0},"unopened":[],"bounds":{"document_bytes":16777216,"sheet_cells":100000,"rows_first":2000,"rows_last":500,"rows_between":2000,"halvings":0,"cell_chars":16384,"cell_head_chars":4096},"cells_cut":0,"cells_raw":0,"read":"whole","date_system":"1900"}

{"sheet":"Home","index":0,"n_rows":68,"n_cols":8,"rows_kept":68,"cut":false,"hidden":false,"merged":[[50,4,50,5],[43,4,43,5],[46,4,46,5],[47,4,47,5],[5,4,5,5],[8,4,9,5]]}
["DevFrame settings",null,"H",null,null,null,null,"H"]
["HiddenStatus","VISIBLE",null,null,null,"ENGINEXCEL"]
["ProtectSheet",true,null,null,null,"Email: alessandro@enginexcel.com"]
["HeadingsVisibility",false,null,null,null,"Website: www.enginexcel.com"]
["GridlineVisibility",false]
[null,null,null,null,"TIME CARD CALCULATOR"]
["Protection settings"]
["DrawingObjects",true,null,null,"Introduction"]
["Contents",true,null,null,"This spreadsheet allows to record entries of employees and automatically calculate the number of hours worked."]
["Scenarios",true]
["UserInterfaceOnly",false]
["AllowFormattingCells",false,null,null,"Features"]
["AllowFormattingColumns",false,null,null,"- Customisable list of employees up to 50 entries"]
["AllowFormattingRows",false,null,null,"- Single button press entry registration"]
["AllowInsertingColumns",false,null,null,"- Registration of a past entry/exit event"]
["AllowInsertingRows",false,null,null,"- Registration of a past workday"]
["AllowInsertingHyperlinks",false,null,null,"- Identification of employees currently in and out"]
["AllowDeletingColumns",false,null,null,"- Cancellation of up to 5 latest entries"]
["AllowDeletingRows",false,null,null,"- Warning for missed entries (if last entry is older than 12 hours)"]
["AllowSorting",false,null,null,"- Cancellation of employees and relative records"]
["AllowFiltering",false,null,null,"- Automated ordering of employees names in alphabetical order"]
["AllowUsingPivotTables",false,null,null,"- Automated timesheet report"]
["EnableSelection",false,null,null,"- Timesheet report start and stop date setting"]
[null,null,null,null,"- Timesheet report frequency setting"]
["Other settings",null,null,null,"- Timesheet automated totals calculation"]
["MarkProtectedCellsStatus",false,null,null,"- Timesheet customised formula"]
["RowColumnDimensionStatus",false,null,null,"- Poke yoke features to avoid errors"]
[]
[null,null,null,null,"Instructions"]
[null,null,null,null,"Operation","How to"]
{"$rows_left_out":39}
{"sheet":"Main Page","index":1,"n_rows":59,"n_cols":13,"rows_kept":59,"cut":false,"hidden":false,"merged":[[5,8,5,9],[5,4,5,5]]}
["DevFrame settings",null,"H",null,null,null,null,null,null,null,"H",null,"H"]
["HiddenStatus","VISIBLE",null,null,null,null,null,null,null,null,true]
["ProtectSheet",true]
["HeadingsVisibility",false]
["GridlineVisibility",false]
[null,null,null,null,"NAME",null,null,null,"Last entries:",null,"Row"]
["Protection settings",null,null,null,{"$f":"IF('Entries table'!F7<>\"\",'Entries table'!F7,\"\")","v":"Insert name here"},{"$f":"MOD('Entries table'!E7,2)","v":0}]
["DrawingObjects",true,null,null,{"$f":"IF('Entries table'!F8<>\"\",'Entries table'!F8,\"\")","v":""},{"$f":"MOD('Entries table'!E8,2)","v":0}]
["Contents",true,null,null,{"$f":"IF('Entries table'!F9<>\"\",'Entries table'!F9,\"\")","v":""},{"$f":"MOD('Entries table'!E9,2)","v":0}]
["Scenarios",true,null,null,{"$f":"IF('Entries table'!F10<>\"\",'Entries table'!F10,\"\")","v":""},{"$f":"MOD('Entries table'!E10,2)","v":0}]
["UserInterfaceOnly",true,null,null,{"$f":"IF('Entries table'!F11<>\"\",'Entries table'!F11,\"\")","v":""},{"$f":"MOD('Entries table'!E11,2)","v":0}]
["AllowFormattingCells",true,null,null,{"$f":"IF('Entries table'!F12<>\"\",'Entries table'!F12,\"\")","v":""},{"$f":"MOD('Entries table'!E12,2)","v":0}]
["AllowFormattingColumns",true,null,null,{"$f":"IF('Entries table'!F13<>\"\",'Entries table'!F13,\"\")","v":""},{"$f":"MOD('Entries table'!E13,2)","v":0}]
["AllowFormattingRows",true,null,null,{"$f":"IF('Entries table'!F14<>\"\",'Entries table'!F14,\"\")","v":""},{"$f":"MOD('Entries table'!E14,2)","v":0}]
["AllowInsertingColumns",false,null,null,{"$f":"IF('Entries table'!F15<>\"\",'Entries table'!F15,\"\")","v":""},{"$f":"MOD('Entries table'!E15,2)","v":0}]
["AllowInsertingRows",false,null,null,{"$f":"IF('Entries table'!F16<>\"\",'Entries table'!F16,\"\")","v":""},{"$f":"MOD('Entries table'!E16,2)","v":0}]
["AllowInsertingHyperlinks",false,null,null,{"$f":"IF('Entries table'!F17<>\"\",'Entries table'!F17,\"\")","v":""},{"$f":"MOD('Entries table'!E17,2)","v":0}]
["AllowDeletingColumns",false,null,null,{"$f":"IF('Entries table'!F18<>\"\",'Entries table'!F18,\"\")","v":""},{"$f":"MOD('Entries table'!E18,2)","v":0}]
["AllowDeletingRows",false,null,null,{"$f":"IF('Entries table'!F19<>\"\",'Entries table'!F19,\"\")","v":""},{"$f":"MOD('Entries table'!E19,2)","v":0}]
["AllowSorting",false,null,null,{"$f":"IF('Entries table'!F20<>\"\",'Entries table'!F20,\"\")","v":""},{"$f":"MOD('Entries table'!E20,2)","v":0}]
["AllowFiltering",false,null,null,{"$f":"IF('Entries table'!F21<>\"\",'Entries table'!F21,\"\")","v":""},{"$f":"MOD('Entries table'!E21,2)","v":0}]
["AllowUsingPivotTables",false,null,null,{"$f":"IF('Entries table'!F22<>\"\",'Entries table'!F22,\"\")","v":""},{"$f":"MOD('Entries table'!E22,2)","v":0}]
["EnableSelection",true,null,null,{"$f":"IF('Entries table'!F23<>\"\",'Entries table'!F23,\"\")","v":""},{"$f":"MOD('Entries table'!E23,2)","v":0}]
[null,null,null,null,{"$f":"IF('Entries table'!F24<>\"\",'Entries table'!F24,\"\")","v":""},{"$f":"MOD('Entries table'!E24,2)","v":0}]
["Other settings",null,null,null,{"$f":"IF('Entries table'!F25<>\"\",'Entries table'!F25,\"\")","v":""},{"$f":"MOD('Entries table'!E25,2)","v":0}]
["MarkProtectedCellsStatus",true,null,null,{"$f":"IF('Entries table'!F26<>\"\",'Entries table'!F26,\"\")","v":""},{"$f":"MOD('Entries table'!E26,2)","v":0}]
["RowColumnDimensionStatus",true,null,null,{"$f":"IF('Entries table'!F27<>\"\",'Entries table'!F27,\"\")","v":""},{"$f":"MOD('Entries table'!E27,2)","v":0}]
[null,null,null,null,{"$f":"IF('Entries table'!F28<>\"\",'Entries table'!F28,\"\")","v":""},{"$f":"MOD('Entries table'!E28,2)","v":0}]
[null,null,null,null,{"$f":"IF('Entries table'!F29<>\"\",'Entries table'!F29,\"\")","v":""},{"$f":"MOD('Entries table'!E29,2)","v":0}]
[null,null,null,null,{"$f":"IF('Entries table'!F30<>\"\",'Entries table'!F30,\"\")","v":""},{"$f":"MOD('Entries table'!E30,2)","v":0}]
{"$rows_left_out":30}
{"sheet":"Entries table","index":2,"n_rows":59,"n_cols":667,"rows_kept":59,"cut":false,"hidden":false,"merged":[]}
["DevFrame settings",null,"H",null,"H",null,null,null,null,null,null,null,null,null,null,null,null,null,null,null,null,null,null,null,null,null,null,null,null,null,null,null,null,null,null,null,null,null,null,null,null,null,null,null,null,null,null,null,null,null,null,null,null,null,null,null,null,null,null,null,null,null,null,null,null,null,null,null,null,null,null,null,null,null,null,null,null,null,null,null,null,null,null,null,null,null,null,null,null,null,null,null,null,null,null,null,null,null,null,null,null,null,null,null,null,null,null,null,null,null,null,null,null,null,null,null,null,null,null,null,null,null,null,null,null,null,null,null,null,null,null,null,null,null,null,null,null,null,null,null,null,null,null,null,null,null,null,null,null,null,null,null,null,null,null,null,null,null,null,null,null,null,null,null,null,null,null,null,null,null,null,null,null,null,null,null,null,null,null,null,null,null,null,null,null,null,null,null,null,null,null,null,null,null,null,null,null,null,null,null,null,null,null,null,null,null,null,null,null,null,null,null,null,null,null,null,null,null,null,null,null,null,null,null,null,null,null,null,null,null,null,null,null,null,null,null,null,null,null,null,null,null,null,null,null,null,null,null,null,null,null,null,null,null,null,null,null,null,null,null,null,null,null,null,null,null,null,null,null,null,null,null,null,null,null,null,null,null,null,null,null,null,null,null,null,null,null,null,null,null,null,null,null,null,null,null,null,null,null,null,null,null,null,null,null,null,null,null,null,null,null,null,null,null,null,null,null,null,null,null,null,null,null,null,null,null,null,null,null,null,null,null,null,null,null,null,null,null,null,null,null,null,null,null,null,null,null,null,null,null,null,null,null,null,null,null,null,null,null,null,null,null,null,null,null,null,null,null,null,null,null,null,null,null,null,null,null,null,null,null,null,null,null,null,null,null,null,null,null,null,null,null,null,null,null,null,null,null,null,null,null,null,null,null,null,null,null,null,null,null,null,null,null,null,null,null,null,null,null,null,null,null,null,null,null,null,null,null,null,null,null,null,null,null,null,null,null,null,null,null,null,null,null,null,null,null,null,null,null,null,null,null,null,null,null,null,null,null,null,null,null,null,null,null,null,null,null,null,null,null,null,null,null,null,null,null,null,null,null,null,null,null,null,null,null,null,null,null,null,null,null,null,null,null,null,null,null,null,null,null,null,null,null,null,null,null,null,null,null,null,null,null,null,null,null,null,null,null,null,null,null,null,null,null,null,null,null,null,null,null,null,null,null,null,null,null,null,null,null,null,null,null,null,null,null,null,null,null,null,null,null,null,null,null,null,null,null,null,null,null,null,null,null,null,null,null,null,null,null,null,null,null,null,null,null,null,null,null,null,null,null,null,null,null,null,null,null,null,null,null,null,null,null,null,null,null,null,null,null,null,null,null,null,null,null,null,null,null,null,null,null,null,null,null,null,null,null,null,null,null,null,null,null,null,null,null,null,null,null,null,null,null,null,null,null,null,null,null,null,null,null,null,null,null,null,null,null,null,null,null,null,null,null,null,null,null,null,null,null,null,null,null,null,null,null,null,"H"]
["HiddenStatus","VISIBLE"]
["ProtectSheet",true]
["HeadingsVisibility",false]
["GridlineVisibility",false]
[null,null,null,null,{"$f":"MAX(E7:E56)","v":0},"NAME","   ENTRIES  (older -->)"]
["Protection settings",null,null,null,{"$f":"COUNTA(G7:YQ7)","v":0},"Insert name here"]
["DrawingObjects",true,null,null,0]
["Contents",true,null,null,0]
["Scenarios",true,null,null,{"$f":"COUNTA(G10:YQ10)","v":0}]
["UserInterfaceOnly",true,null,null,0]
["AllowFormattingCells",true,null,null,0]
["AllowFormattingColumns",true,null,null,0]
["AllowFormattingRows",true,null,null,0]
["AllowInsertingColumns",false,null,null,0]
["AllowInsertingRows",false,null,null,0]
["AllowInsertingHyperlinks",false,null,null,0]
["AllowDeletingColumns",false,null,null,0]
["AllowDeletingRows",false,null,null,0]
["AllowSorting",false,null,null,0]
["AllowFiltering",false,null,null,0]
["AllowUsingPivotTables",false,null,null,0]
["EnableSelection",false,null,null,0]
[null,null,null,null,0]
["Other settings",null,null,null,0]
["MarkProtectedCellsStatus",true,null,null,0]
["RowColumnDimensionStatus",true,null,null,0]
[null,null,null,null,0]
[null,null,null,null,0]
[null,null,null,null,0]
{"$rows_left_out":30}
{"sheet":"Report","index":3,"n_rows":61,"n_cols":1029,"rows_kept":61,"cut":false,"hidden":false,"merged":[[8,4,21,4]]}
["DevFrame settings",null,"H",null,null,null,null,null,null,null,null,null,null,null,null,null,null,null,null,null,null,null,null,null,null,null,null,null,null,null,null,null,null,null,null,null,null,null,null,null,null,null,null,null,null,null,null,null,null,null,null,null,null,null,null,null,null,null,null,null,null,null,null,null,null,null,null,null,null,null,null,null,null,null,null,null,null,null,null,null,null,null,null,null,null,null,null,null,null,null,null,null,null,null,null,null,null,null,null,null,null,null,null,null,null,null,null,null,null,null,null,null,null,null,null,null,null,null,null,null,null,null,null,null,null,null,null,null,null,null,null,null,null,null,null,null,null,null,null,null,null,null,null,null,null,null,null,null,null,null,null,null,null,null,null,null,null,null,null,null,null,null,null,null,null,null,null,null,null,null,null,null,null,null,null,null,null,null,null,null,null,null,null,null,null,null,null,null,null,null,null,null,null,null,null,null,null,null,null,null,null,null,null,null,null,null,null,null,null,null,null,null,null,null,null,null,null,null,null,null,null,null,null,null,null,null,null,null,null,null,null,null,null,null,null,null,null,null,null,null,null,null,null,null,null,null,null,null,null,null,null,null,null,null,null,null,null,null,null,null,null,null,null,null,null,null,null,null,null,null,null,null,null,null,null,null,null,null,null,null,null,null,null,null,null,null,null,null,null,null,null,null,null,null,null,null,null,null,null,null,null,null,null,null,null,null,null,null,null,null,null,null,null,null,null,null,null,null,null,null,null,null,null,null,null,null,null,null,null,null,null,null,null,null,null,null,null,null,null,null,null,null,null,null,null,null,null,null,null,null,null,null,null,null,null,null,null,null,null,null,null,null,null,null,null,null,null,null,null,null,null,null,null,null,null,null,null,null,null,null,null,null,null,null,null,null,null,null,null,null,null,null,null,null,null,null,null,null,null,null,null,null,null,null,null,null,null,null,null,null,null,null,null,null,null,null,null,null,null,null,null,null,null,null,null,null,null,null,null,null,null,null,null,null,null,null,null,null,null,null,null,null,null,null,null,null,null,null,null,null,null,null,null,null,null,null,null,null,null,null,null,null,null,null,null,null,null,null,null,null,null,null,null,null,null,null,null,null,null,null,null,null,null,null,null,null,null,null,null,null,null,null,null,null,null,null,null,null,null,null,null,null,null,null,null,null,null,null,null,null,null,null,null,null,null,null,null,null,null,null,null,null,null,null,null,null,null,null,null,null,null,null,null,null,null,null,null,null,null,null,null,null,null,null,null,null,null,null,null,null,null,null,null,null,null,null,null,null,null,null,null,null,null,null,null,null,null,null,null,null,null,null,null,null,null,null,null,null,null,null,null,null,null,null,null,null,null,null,null,null,null,null,null,null,null,null,null,null,null,null,null,null,null,null,null,null,null,null,null,null,null,null,null,null,null,null,null,null,null,null,null,null,null,null,null,null,null,null,null,null,null,null,null,null,null,null,null,null,null,null,null,null,null,null,null,null,null,null,null,null,null,null,null,null,null,null,null,null,null,null,null,null,null,null,null,null,null,null,null,null,null,null,null,null,null,null,null,null,null,null,null,null,null,null,null,null,null,null,null,null,null,null,null,null,null,null,null,null,null,null,null,null,null,null,null,null,null,null,null,null,null,null,null,null,null,null,null,null,null,null,null,null,null,null,null,null,null,null,null,null,null,null,null,null,null,null,null,null,null,null,null,null,null,null,null,null,null,null,null,null,null,null,null,null,null,null,null,null,null,null,null,null,null,null,null,null,null,null,null,null,null,null,null,null,null,null,null,null,null,null,null,null,null,null,null,null,null,null,null,null,null,null,null,null,null,null,null,null,null,null,null,null,null,null,null,null,null,null,null,null,null,null,null,null,null,null,null,null,null,null,null,null,null,null,null,null,null,null,null,null,null,null,null,null,null,null,null,null,null,null,null,null,null,null,null,null,null,null,null,null,null,null,null,null,null,null,null,null,null,null,null,null,null,null,null,null,null,null,null,null,null,null,null,null,null,null,null,null,null,null,null,null,null,null,null,null,null,null,null,null,null,null,null,null,null,null,null,null,null,null,null,null,null,null,null,null,null,null,null,null,null,null,null,null,null,null,null,null,null,null,null,null,null,null,null,null,null,null,null,null,null,null,null,null,null,null,null,null,null,null,null,null,null,null,null,null,null,null,null,null,null,null,null,null,null,null,null,null,null,null,null,null,null,null,null,null,null,null,null,null,null,null,null,null,null,null,null,null,null,null,null,null,null,null,null,null,null,null,null,null,null,null,null,null,null,null,null,null,null,null,null,null,null,null,null,null,null,null,null,null,null,null,null,null,null,null,null,null,null,null,null,null,null,null,null,null,null,null,"H"]
["HiddenStatus","VISIBLE",null,null,null,null,"Start date","2017-05-05"]
["ProtectSheet",true,null,null,null,null,"End date","2017-05-05"]
["HeadingsVisibility",false,null,null,null,null,"Report frequency",1]
["GridlineVisibility",false]
[null,null,null,null,null,null,null,"Start date"]
["Protection settings",null,null,null,null,null,null,"End date"]
["DrawingObjects",true,null,null,null,null,"Custom formula","Total hours"]
["Contents",true,null,null,"NAME          ",{"$f":"IF('Entries table'!F7<>\"\",'Entries table'!F7,\"\")","v":"Insert name here"},null,{"$f":"IF(F9<>\"\",SUM(I9:AMM9),\"\")","v":0}]
["Scenarios",true,null,null,null,{"$f":"IF('Entries table'!F8<>\"\",'Entries table'!F8,\"\")","v":""},null,{"$f":"IF(F10<>\"\",SUM(I10:AMM10),\"\")","v":""}]
["UserInterfaceOnly",true,null,null,null,{"$f":"IF('Entries table'!F9<>\"\",'Entries table'!F9,\"\")","v":""},null,""]
["AllowFormattingCells",true,null,null,null,{"$f":"IF('Entries table'!F10<>\"\",'Entries table'!F10,\"\")","v":""},null,""]
["AllowFormattingColumns",true,null,null,null,{"$f":"IF('Entries table'!F11<>\"\",'Entries table'!F11,\"\")","v":""},null,""]
["AllowFormattingRows",true,null,null,null,{"$f":"IF('Entries table'!F12<>\"\",'Entries table'!F12,\"\")","v":""},null,""]
["AllowInsertingColumns",false,null,null,null,{"$f":"IF('Entries table'!F13<>\"\",'Entries table'!F13,\"\")","v":""},null,""]
["AllowInsertingRows",false,null,null,null,{"$f":"IF('Entries table'!F14<>\"\",'Entries table'!F14,\"\")","v":""},null,""]
["AllowInsertingHyperlinks",false,null,null,null,{"$f":"IF('Entries table'!F15<>\"\",'Entries table'!F15,\"\")","v":""},null,""]
["AllowDeletingColumns",false,null,null,null,{"$f":"IF('Entries table'!F16<>\"\",'Entries table'!F16,\"\")","v":""},null,""]
["AllowDeletingRows",false,null,null,null,{"$f":"IF('Entries table'!F17<>\"\",'Entries table'!F17,\"\")","v":""},null,""]
["AllowSorting",false,null,null,null,{"$f":"IF('Entries table'!F18<>\"\",'Entries table'!F18,\"\")","v":""},null,""]
["AllowFiltering",false,null,null,null,{"$f":"IF('Entries table'!F19<>\"\",'Entries table'!F19,\"\")","v":""},null,""]
["AllowUsingPivotTables",false,null,null,null,{"$f":"IF('Entries table'!F20<>\"\",'Entries table'!F20,\"\")","v":""},null,""]
["EnableSelection",true,null,null,null,{"$f":"IF('Entries table'!F21<>\"\",'Entries table'!F21,\"\")","v":""},null,""]
[null,null,null,null,null,{"$f":"IF('Entries table'!F22<>\"\",'Entries table'!F22,\"\")","v":""},null,""]
["Other settings",null,null,null,null,{"$f":"IF('Entries table'!F23<>\"\",'Entries table'!F23,\"\")","v":""},null,""]
["MarkProtectedCellsStatus",true,null,null,null,{"$f":"IF('Entries table'!F24<>\"\",'Entries table'!F24,\"\")","v":""},null,""]
["RowColumnDimensionStatus",true,null,null,null,{"$f":"IF('Entries table'!F25<>\"\",'Entries table'!F25,\"\")","v":""},null,""]
[null,null,null,null,null,{"$f":"IF('Entries table'!F26<>\"\",'Entries table'!F26,\"\")","v":""},null,""]
[null,null,null,null,null,{"$f":"IF('Entries table'!F27<>\"\",'Entries table'!F27,\"\")","v":""},null,""]
[null,null,null,null,null,{"$f":"IF('Entries table'!F28<>\"\",'Entries table'!F28,\"\")","v":""},null,""]
{"$rows_left_out":32}
{"sheet":"BlankPage","index":4,"n_rows":27,"n_cols":3,"rows_kept":27,"cut":false,"hidden":true,"merged":[]}
["DevFrame settings",null,"H"]
["HiddenStatus","VERY HIDDEN"]
["ProtectSheet",false]
["HeadingsVisibility",false]
["GridlineVisibility",false]
[]
["Protection settings"]
["DrawingObjects",true]
["Contents",true]
["Scenarios",true]
["UserInterfaceOnly",false]
["AllowFormattingCells",false]
["AllowFormattingColumns",false]
["AllowFormattingRows",false]
["AllowInsertingColumns",false]
["AllowInsertingRows",false]
["AllowInsertingHyperlinks",false]
["AllowDeletingColumns",false]
["AllowDeletingRows",false]
["AllowSorting",false]
["AllowFiltering",false]
["AllowUsingPivotTables",false]
["EnableSelection",false]
[]
["Other settings"]
["MarkProtectedCellsStatus",false]
["RowColumnDimensionStatus",false]

{"sheet":"WelcomePage","index":5,"n_rows":48,"n_cols":6,"rows_kept":48,"cut":false,"hidden":true,"merged":[[2,4,2,9],[9,4,9,9],[19,4,19,9]]}
["DevFrame settings",null,"H"]
["HiddenStatus","VERY HIDDEN"]
["ProtectSheet",false,null,null,"COUNTERS"]
["HeadingsVisibility",false]
["GridlineVisibility",false,null,null,"OpenedTimes",1]
[null,null,null,null,"NotShowAgain",false]
["Protection settings"]
["DrawingObjects",true]
["Contents",true]
["Scenarios",true,null,null,"MESSAGES RELATED TO SPREADSHEET"]
["UserInterfaceOnly",false]
["AllowFormattingCells",false,null,null,"SpreadsheetName"]
["AllowFormattingColumns",false,null,null,"Time card calculator"]
["AllowFormattingRows",false]
["AllowInsertingColumns",false,null,null,"VideoLink"]
["AllowInsertingRows",false,null,null,"https://youtu.be/ifGIaoJHupQ"]
["AllowInsertingHyperlinks",false]
["AllowDeletingColumns",false]
["AllowDeletingRows",false]
["AllowSorting",false,null,null,"MESSAGES VALID FOR ALL SPREADSHEETS"]
["AllowFiltering",false]
["AllowUsingPivotTables",false,null,null,"WelcomeText"]
["EnableSelection",false,null,null,"Thanks for downloading EnginExcel free material."]
[null,null,null,null,{"$f":"\"A quick introductory video on \"  & SpreadsheetName &  \" main functionalities is linked below.\"","v":"A quick introductory video on Time card calculator main functionalities is linked below."}]
["Other settings"]
["MarkProtectedCellsStatus",false,null,null,"ButtonText"]
["RowColumnDimensionStatus",false,null,null,"Introductory video"]
[]
[null,null,null,null,"FreeMaterialText"]
[null,null,null,null,"If you like this spreadsheet please consider subscribing to EnginExcel free material newsletter. You will receive an email when a new free spreadsheet is released."]
{"$rows_left_out":19}
{"sheet":"Settings","index":6,"n_rows":27,"n_cols":15,"rows_kept":27,"cut":false,"hidden":true,"merged":[[8,4,8,14],[9,6,9,8],[9,9,9,11],[9,12,9,14]]}
["DevFrame settings",null,"H"]
["HiddenStatus","VERY HIDDEN"]
["ProtectSheet",false,null,null,"Max number of entries","Alert time for employees in (hours)"]
["HeadingsVisibility",false,null,null,50,12]
["GridlineVisibility",false]
[]
["Protection settings"]
["DrawingObjects",true]
["Contents",true,null,null,"COLOUR SETS"]
["Scenarios",true,null,null,null,null,"Light",null,null,"Medium",null,null,"Dark"]
["UserInterfaceOnly",false,null,null,"#","Name","R","G","B","R","G","B","R","G","B"]
["AllowFormattingCells",false,null,null,1,"Green",229,245,224,161,217,155,49,163,84]
["AllowFormattingColumns",false,null,null,2,"Blue",222,235,247,158,202,225,49,130,189]
["AllowFormattingRows",false,null,null,3,"Red",254,224,210,252,146,114,222,45,38]
["AllowInsertingColumns",false,null,null,4,"Purple",239,237,245,188,189,220,117,107,177]
["AllowInsertingRows",false,null,null,5,"Grey",240,240,240,189,189,189,99,99,99]
["AllowInsertingHyperlinks",false]
["AllowDeletingColumns",false]
["AllowDeletingRows",false]
["AllowSorting",false]
["AllowFiltering",false]
["AllowUsingPivotTables",false]
["EnableSelection",false]
[]
["Other settings"]
["MarkProtectedCellsStatus",false]
["RowColumnDimensionStatus",false]

{"sheet":"DevFrame","index":7,"n_rows":35,"n_cols":9,"rows_kept":35,"cut":false,"hidden":true,"merged":[]}
["DevFrame settings",null,"H",null,null,null,null,null,"H"]
["HiddenStatus","VERY HIDDEN",null,"HiddenStatuses","TrueFalse"]
["ProtectSheet",false,null,"VISIBLE",true]
["HeadingsVisibility",true,null,"HIDDEN",false]
["GridlineVisibility",true,null,"VERY HIDDEN"]
[]
["Protection settings",null,null,"ProgrammingMode","Password","DevFramePassword"]
["DrawingObjects",true,null,false,"Password","EnginExce1"]
["Contents",true]
["Scenarios",true,null,"AllowAddSheet"]
["UserInterfaceOnly",false,"H",true]
["AllowFormattingCells",false]
["AllowFormattingColumns",false]
["AllowFormattingRows",false]
["AllowInsertingColumns",false,null,null,"DEVELOPMENT FRAME"]
["AllowInsertingRows",false,null,"Features:"]
["AllowInsertingHyperlinks",false,null,"- Define visibility status of each sheet"]
["AllowDeletingColumns",false,null,"- Define which cells to protect"]
["AllowDeletingRows",false,null,"- Protect sheet with password"]
["AllowSorting",false,null,"- Define if to show the headings of each page"]
["AllowFiltering",false,null,"- Define if to show the gridline in each page"]
["AllowUsingPivotTables",false,null,"- Dev frame is protected by separate password"]
["EnableSelection",false,null,"- Define which rows and columns to hide"]
[null,null,null,"      - Rows and columns with \"H\" are hidden"]
["Other settings",null,null,"      - From the last \"H\", all the following rows (or columns) are hidden"]
["MarkProtectedCellsStatus",true]
["RowColumnDimensionStatus",false,null,"Activation:"]
[null,null,null,"- Activate development frame: CTRL + r"]
[null,null,null,"- Protect a selected cell: CTRL + p"]
[null,null,null,"- Unprotect a selected cell: CTRL + o"]
{"$rows_left_out":5}